4,5,5-trimethyl-1-hexanol
- Formula: C9H20O
- Molecular weight: 144.2545
- IUPAC Standard InChIKey: IECJUMYEWJOKHM-UHFFFAOYSA-N
- CAS Registry Number: 66793-75-7
- Chemical structure:
View 3d structure (requires JavaScript / HTML 5) - Permanent link for this species. Use this link for bookmarking this species for future reference.

Phase change data

Data compiled by: Thermodynamics Research Center, NIST Boulder Laboratories, Chris Muzny director
Quantity | Value | Units | Method | Reference | Comment |
---|---|---|---|---|---|
Tboil | 475.55 | K | N/A | Dean, 1954 | Uncertainty assigned by TRC = 3. K |

References

Dean, 1954
Dean, F.,
, 1954. [all data]