(R)-(+)-3-Methylcyclopentanone
- Formula: C6H10O
- Molecular weight: 98.1430
- IUPAC Standard InChIKey: AOKRXIIIYJGNNU-YFKPBYRVSA-N
- CAS Registry Number: 6672-30-6
- Chemical structure:
View 3d structure (requires JavaScript / HTML 5) - Stereoisomers:
- Other names: Cyclopentanone, 3-methyl-, (R)-; (+)-3-methylcyclopentanone

Phase change data

Data compiled by: Robert L. Brown and Stephen E. Stein
Quantity | Value | Units | Method | Reference | Comment |
---|---|---|---|---|---|
Tboil | 416.7 | K | N/A | Aldrich Chemical Company Inc., 1990 |

References

Aldrich Chemical Company Inc., 1990
Aldrich Chemical Company Inc.,
Catalog Handbook of Fine Chemicals, Aldrich Chemical Company, Inc., Milwaukee WI, 1990, 1. [all data]