1-hexanol, 4-methyl-2-(1-methylethyl)-

Phase change data

Data compiled by: Thermodynamics Research Center, NIST Boulder Laboratories, Chris Muzny director

Quantity Value Units Method Reference Comment
Tboil474.65KN/AHagemeyer and Hudson, 1958Uncertainty assigned by TRC = 4. K
Quantity Value Units Method Reference Comment
Tfus397.15KN/AMichelotti, Knuth, et al., 1959Uncertainty assigned by TRC = 2. K

In addition to the Thermodynamics Research Center (TRC) data available from this site, much more physical and chemical property data is available from the following TRC products:

References

Hagemeyer and Hudson, 1958
Hagemeyer, H.J.; Hudson, G.V., , 1958. [all data]

Michelotti, Knuth, et al., 1959
Michelotti, F.W.; Knuth, C.J.; Bavley, A., Some Anhydride Curing Agents for Epoxy Resins, J. Chem. Eng. Data, 1959, 4, 79. [all data]