Bicyclo(3.3.1)non-2-ene
- Formula: C9H14
- Molecular weight: 122.2075
- IUPAC Standard InChIKey: CEVDPSDZXGCLEI-UHFFFAOYSA-N
- CAS Registry Number: 6671-66-5
- Chemical structure:
View 3d structure (requires JavaScript / HTML 5) - Permanent link for this species. Use this link for bookmarking this species for future reference.

Gas phase thermochemistry data

Data compiled by: Hussein Y. Afeefy, Joel F. Liebman, and Stephen E. Stein
Quantity | Value | Units | Method | Reference | Comment |
---|---|---|---|---|---|
ΔfH°gas | -49.1 ± 1.4 | kJ/mol | Ccb | Jochem, Dekker, et al., 1983 |

Condensed phase thermochemistry data

Data compiled by: Hussein Y. Afeefy, Joel F. Liebman, and Stephen E. Stein
Quantity | Value | Units | Method | Reference | Comment |
---|---|---|---|---|---|
ΔfH°solid | -97.3 ± 1.3 | kJ/mol | Ccb | Jochem, Dekker, et al., 1983 | |
Quantity | Value | Units | Method | Reference | Comment |
ΔcH°solid | -5445.1 ± 1.3 | kJ/mol | Ccb | Jochem, Dekker, et al., 1983 | Corresponding ΔfHºsolid = -97.3 kJ/mol (simple calculation by NIST; no Washburn corrections) |

Phase change data

Data compiled as indicated in comments:
ALS - Hussein Y. Afeefy, Joel F. Liebman, and Stephen E. Stein
DRB - Donald R. Burgess, Jr.
AC - William E. Acree, Jr., James S. Chickos
Quantity | Value | Units | Method | Reference | Comment |
---|---|---|---|---|---|
ΔsubH° | 48.2 ± 0.4 | kJ/mol | V | Jochem, Dekker, et al., 1983 | ALS |
ΔsubH° | 48.2 | kJ/mol | N/A | Jochem, Dekker, et al., 1983 | DRB |
ΔsubH° | 48.2 ± 0.4 | kJ/mol | C | Jochems, Dekker, et al., 1982 | AC |

References

Jochem, Dekker, et al., 1983
Jochem, R.; Dekker, H.; Mosselman, C.; Soumen, G.,
J. Chem. Thermodyn., 1983, 15, 95. [all data]
Jochems, Dekker, et al., 1982
Jochems, R.; Dekker, H.; Mosselman, C.; Somsen, G.,
Enthalpies of sublimation of bicyclo[3.3.1]non-2-ene, bicyclo[3.2.2]non-6-ene, and bicyclo[4.2.1]non-3-ene,
J. Chem. Thermodyn., 1982, 14, 799-800. [all data]