1H-Benzimidazol-2-acetonitrile,α-([2methoxyphenyl]methylene)-

Condensed phase thermochemistry data

Data compiled by: Hussein Y. Afeefy, Joel F. Liebman, and Stephen E. Stein

Quantity Value Units Method Reference Comment
Δfliquid206.5kJ/molCcbZavoianu, Ciocazanu, et al., 1990
Quantity Value Units Method Reference Comment
Δcliquid-8754.2kJ/molCcbZavoianu, Ciocazanu, et al., 1990

References

Zavoianu, Ciocazanu, et al., 1990
Zavoianu, D.; Ciocazanu, I.; Moga-Gheorghe, S.; Bornaz, C., Structure and reactivity of nitriles. Heats of combustion and formation of α,β-unsaturated nitriles dervied from benzylidene-1H-benzimidazol-2-acetonitrile, Rev. Chim. (Bucharest), 1990, 40, 15-18. [all data]