1,2,4-Butanetriol, trinitrate
- Formula: C4H7N3O9
- Molecular weight: 241.1131
- IUPAC Standard InChIKey: RDLIBIDNLZPAQD-UHFFFAOYSA-N
- CAS Registry Number: 6659-60-5
- Chemical structure:
View 3d structure (requires JavaScript / HTML 5) - Other names: Butane-1,2,4-triyl nitrate; butane-1,2,4-triyl trinitrate

Condensed phase thermochemistry data

Data compiled by: Hussein Y. Afeefy, Joel F. Liebman, and Stephen E. Stein
Quantity | Value | Units | Method | Reference | Comment |
---|---|---|---|---|---|
ΔfH°liquid | -414. | kJ/mol | Ccb | Handrick, 1956 | Naval Powder Factory, 1951 |
Quantity | Value | Units | Method | Reference | Comment |
ΔcH°liquid | -2311. | kJ/mol | Ccb | Handrick, 1956 | Naval Powder Factory, 1951 |
ΔcH°liquid | -2177. | kJ/mol | Ccb | Handrick, 1956 | Army-Navy Soild propellant Group. 1948 |
Quantity | Value | Units | Method | Reference | Comment |
ΔcH°solid | -2175.7 | kJ/mol | Ccb | Castronia, 1949 |

Kovats' RI, non-polar column, temperature ramp

Column type | Active phase | I | Reference | Comment |
---|---|---|---|---|
Packed | OV-101 | 1532. | Alley and Dykes, 1972 | 6. K/min; Tstart: 70. C; Tend: 220. C |

References

Handrick, 1956
Handrick, G.R.,
Report of the study of pure explosive compounds. Part IV. Calculation of heat of combustion of organic compounds from structural features and calculation of power of high explosives, Rpt. C-58247 for the Office of the Chief of Ordnance, contract DA-19-020-ORD-47 by the Arthur D. Little, Inc., Cambridge, MA, 1956, 467-573. [all data]
Castronia, 1949
Castronia, T.C.,
Long range basic research leading to the development of ideal propellants,
Picatinny Arsenal Techn. Rep. No. 1755, 1949, 1. [all data]
Alley and Dykes, 1972
Alley, B.J.; Dykes, H.W.H.,
Gas-Liquid Chromatographic Determination of Nitrate Esters,Stabilizers and Plasticizers in Nitrocellulose-Base Propellants,
J. Chromatogr., 1972, 71, 1, 23-37, https://doi.org/10.1016/S0021-9673(01)85687-9
. [all data]