Guanidine, 1-(1H-tetrazol-5-yl)-
- Formula: C2H5N7
- Molecular weight: 127.1080
- IUPAC Standard InChIKey: IPZQGRLGQRWVRV-UHFFFAOYSA-N
- CAS Registry Number: 66591-60-4
- Chemical structure:
View 3d structure (requires JavaScript / HTML 5) - Permanent link for this species. Use this link for bookmarking this species for future reference.

Condensed phase thermochemistry data

Data compiled by: Hussein Y. Afeefy, Joel F. Liebman, and Stephen E. Stein
Quantity | Value | Units | Method | Reference | Comment |
---|---|---|---|---|---|
ΔfH°solid | 128.7 | kJ/mol | Ccr | Baroody and Carpenter, 1976 | |
Quantity | Value | Units | Method | Reference | Comment |
ΔcH°solid | -1693. | kJ/mol | Ccb | Handrick, 1956 | Picatinny Arsenal Tech. report 1941 by S. Helf, I. Minsky, and B.D. Guida |

References

Baroody and Carpenter, 1976
Baroody, E.E.; Carpenter, G.A.,
Heats of formation of propellant compounds (U), Rpt. NCWC/WOL-TR-76-77 by Naval Surface Weapons Center, Silver Spring, MD, 1976, 1-20. [all data]
Handrick, 1956
Handrick, G.R.,
Report of the study of pure explosive compounds. Part IV. Calculation of heat of combustion of organic compounds from structural features and calculation of power of high explosives, Rpt. C-58247 for the Office of the Chief of Ordnance, contract DA-19-020-ORD-47 by the Arthur D. Little, Inc., Cambridge, MA, 1956, 467-573. [all data]