3,3,5-trimethylcyclopentene
- Formula: C8H14
- Molecular weight: 110.1968
- IUPAC Standard InChIKey: DUDYIBGKPFJUEF-UHFFFAOYSA-N
- CAS Registry Number: 66577-28-4
- Chemical structure:
View 3d structure (requires JavaScript / HTML 5) - Permanent link for this species. Use this link for bookmarking this species for future reference.

Phase change data

Data compiled by: Thermodynamics Research Center, NIST Boulder Laboratories, Chris Muzny director
Quantity | Value | Units | Method | Reference | Comment |
---|---|---|---|---|---|
Tboil | 368.4 | K | N/A | Birch and Johnson, 1951 | Uncertainty assigned by TRC = 0.6 K |
Tboil | 368.21 | K | N/A | Slomp, 1951 | Uncertainty assigned by TRC = 0.2 K |
Tboil | 368.4 | K | N/A | Anonymous, 1945 | Uncertainty assigned by TRC = 0.4 K |
Quantity | Value | Units | Method | Reference | Comment |
Tfus | 165.20 | K | N/A | Birch and Johnson, 1951 | Uncertainty assigned by TRC = 0.3 K |
Tfus | 164.73 | K | N/A | Slomp, 1951 | Uncertainty assigned by TRC = 0.6 K |
Tfus | 165.20 | K | N/A | Anonymous, 1945 | Uncertainty assigned by TRC = 0.2 K |

References

Birch and Johnson, 1951
Birch; Johnson,
J. Chem. Soc., 1951, 1951, 1493. [all data]
Slomp, 1951
Slomp, G.,
, Ph.D. Thesis, Ohio State Univ., Columbus, OH, 1951. [all data]
Anonymous, 1945
Anonymous, R.,
, Sunbury Rep. No. 2777, Anglo-Iranian Oil Co. Ltd., 1945. [all data]