1-Tritetracontene

Phase change data

Data compiled by: William E. Acree, Jr., James S. Chickos

Enthalpy of vaporization

ΔvapH (kJ/mol) Temperature (K) Method Reference Comment
138.7545.N/ADykyj, Svoboda, et al., 1999Based on data from 530. - 812. K.
137.7587.A,EStephenson and Malanowski, 1987Based on data from 572. - 820. K. See also Kudchadker and Zwolinski, 1966.

References

Dykyj, Svoboda, et al., 1999
Dykyj, J.; Svoboda, J.; Wilhoit, R.C.; Frenkel, M.L.; Hall, K.R., Vapor Pressure of Chemicals: Part A. Vapor Pressure and Antoine Constants for Hydrocarbons and Sulfur, Selenium, Tellurium and Hydrogen Containing Organic Compounds, Springer, Berlin, 1999, 373. [all data]

Stephenson and Malanowski, 1987
Stephenson, Richard M.; Malanowski, Stanislaw, Handbook of the Thermodynamics of Organic Compounds, 1987, https://doi.org/10.1007/978-94-009-3173-2 . [all data]

Kudchadker and Zwolinski, 1966
Kudchadker, A.P.; Zwolinski, B.J., Vapor Pressure and Boiling Points of Normal Alkanes, C 21 to C 100 ., J. Chem. Eng. Data, 1966, 11, 2, 253-255, https://doi.org/10.1021/je60029a039 . [all data]