3-ethyl-4-methyl-2-pentanol
- Formula: C8H18O
- Molecular weight: 130.2279
- IUPAC Standard InChIKey: PFRFNYYIOSQSDD-UHFFFAOYSA-N
- CAS Registry Number: 66576-23-6
- Chemical structure:
View 3d structure (requires JavaScript / HTML 5) - Permanent link for this species. Use this link for bookmarking this species for future reference.

Phase change data

Data compiled by: Thermodynamics Research Center, NIST Boulder Laboratories, Chris Muzny director
Quantity | Value | Units | Method | Reference | Comment |
---|---|---|---|---|---|
Tboil | 437. | K | N/A | Whitmore, Whitmore, et al., 1950 | Uncertainty assigned by TRC = 3. K |
Tboil | 445.15 | K | N/A | Clarke, 1908 | Uncertainty assigned by TRC = 3. K |

References

Whitmore, Whitmore, et al., 1950
Whitmore, F.C.; Whitmore, H.E.; Cook, N.C.,
Hydrocarbons: X. Three New Octenes,
J. Am. Chem. Soc., 1950, 72, 51. [all data]
Clarke, 1908
Clarke, L.,
Diethylisopropylmethane.,
Am. Chem. J., 1908, 39, 572. [all data]