pentane, 3-bromo-3-(bromomethyl)-
- Formula: C6H12Br2
- Molecular weight: 243.967
- IUPAC Standard InChIKey: UBFOYEMXPUOMHZ-UHFFFAOYSA-N
- CAS Registry Number: 66567-11-1
- Chemical structure:
View 3d structure (requires JavaScript / HTML 5) - Species with the same structure:

Phase change data

Data compiled by: Thermodynamics Research Center, NIST Boulder Laboratories, Chris Muzny director
Quantity | Value | Units | Method | Reference | Comment |
---|---|---|---|---|---|
Tfus | 204.15 | K | N/A | Timmermans, 1952 | Uncertainty assigned by TRC = 1.5 K |

References

Timmermans, 1952
Timmermans, J.,
Freezing points of organic compounds. VVI New determinations.,
Bull. Soc. Chim. Belg., 1952, 61, 393. [all data]