Cyclopentane, 1-methyl-2-(4-methylpentyl)-, trans-
- Formula: C12H24
- Molecular weight: 168.3190
- IUPAC Standard InChIKey: YWCSZNJUSYMHHA-VXGBXAGGSA-N
- CAS Registry Number: 66553-50-2
- Chemical structure:
View 3d structure (requires JavaScript / HTML 5) - Other names: trans-1-Methyl-2-(4-methylpentyl)cyclopentane

Kovats' RI, non-polar column, custom temperature program

Column type | Active phase | I | Reference | Comment |
---|---|---|---|---|
Capillary | Petrocol DH-100 | 1151.8 | Haagen-Smit Laboratory, 1997 | He; Column length: 100. m; Column diameter: 0.2 mm; Program: 5C(10min) => 5C/min => 50C(48min) => 1.5C/min => 195C(91min) |

References

Haagen-Smit Laboratory, 1997
Haagen-Smit Laboratory,
Procedure for the detailed hydrocarbon analysis of gasolines by single column high efficiency (capillary) column gas chromatography, SOP NO. MLD 118, Revision No. 1.1, California Environmental Protection Agency, Air Resources Board, El Monte, California, 1997, 22. [all data]