2,3,9,10-tetramethylanthracene

Phase change data

Data compiled by: Thermodynamics Research Center, NIST Boulder Laboratories, Chris Muzny director

Quantity Value Units Method Reference Comment
Tfus411.KN/AFieser and Webber, 1940Uncertainty assigned by TRC = 4. K
Tfus413.0KN/AFieser and Webber, 1940Uncertainty assigned by TRC = 2. K

In addition to the Thermodynamics Research Center (TRC) data available from this site, much more physical and chemical property data is available from the following TRC products:

References

Fieser and Webber, 1940
Fieser, L.F.; Webber, T.G., meso-Alkyl Anthracenes, J. Am. Chem. Soc., 1940, 62, 1360. [all data]