L-3-Methylhistidine, 2TMS derivative
- Formula: C13H27N3O2Si2
- Molecular weight: 313.5434
- IUPAC Standard InChIKey: BXFVVBRAFGURHG-GFCCVEGCSA-N
- CAS Registry Number: 66434-53-5
- Chemical structure:
View 3d structure (requires JavaScript / HTML 5) - Other names: N,o-Bis-(trimethylsilyl)-1-methylhistidine; 3-Methylhistidine, TMS; 3-Methyl-L-histidine, N-trimethylsilyl-, trimethylsilyl ester; 1-Methyl-L-histidine, N-trimethylsilyl-, trimethylsilyl ester

Van Den Dool and Kratz RI, non-polar column, custom temperature program

Column type | Active phase | I | Reference | Comment |
---|---|---|---|---|
Capillary | VF-5MS | 1801.3 | Tret'yakov, 2007 | 30. m/0.25 mm/0.25 μm, He; Program: Multi-step temperature program; T(initial)=60C; T(final)=270C |
Capillary | VF-5MS | 1867.7 | Tret'yakov, 2007 | 30. m/0.25 mm/0.25 μm, He; Program: Multi-step temperature program; T(initial)=60C; T(final)=270C |

Normal alkane RI, non-polar column, temperature ramp

Column type | Active phase | I | Reference | Comment |
---|---|---|---|---|
Capillary | HP-5MS | 1847. | Lee, Yanamandra, et al., 2002 | 30. m/0.25 mm/0.25 μm, He, 70. C @ 3. min, 4. K/min, 280. C @ 3. min |

References

Tret'yakov, 2007
Tret'yakov, K.V.,
Retention Data. NIST Mass Spectrometry Data Center., NIST Mass Spectrometry Data Center, 2007. [all data]
Lee, Yanamandra, et al., 2002
Lee, B.Y.; Yanamandra, K.; Thurmon, T.F.,
Quantitative estimation of organic analytes with a capillary column,
Am. Clin. Lab., 2002, May, 30-34. [all data]