1-pentyltetralin

Phase change data

Data compiled by: Thermodynamics Research Center, NIST Boulder Laboratories, Chris Muzny director

Quantity Value Units Method Reference Comment
Tboil562.64KN/AKaro, McLaughlin, et al., 1953Uncertainty assigned by TRC = 0.2 K

In addition to the Thermodynamics Research Center (TRC) data available from this site, much more physical and chemical property data is available from the following TRC products:

References

Karo, McLaughlin, et al., 1953
Karo, W.; McLaughlin, R.L.; Hipsher, H.F., Dicyclic Hydrocarbons VI. 1,2,3,5-tetrahydronaphthalene and 1-Alkyl-1,2,3, 4-tetrahydronaphthalenes, J. Am. Chem. Soc., 1953, 75, 3233. [all data]