Benzene, 1-(1,1-dimethylethyl)-3-ethyl-5-methyl-
- Formula: C13H20
- Molecular weight: 176.2979
- IUPAC Standard InChIKey: URDKTSKLGNWKDB-UHFFFAOYSA-N
- CAS Registry Number: 6630-01-9
- Chemical structure:
View 3d structure (requires JavaScript / HTML 5) - Other names: 1-tert-Butyl-3-ethyl-5-methylbenzene; 3-tert-Butyl-5-ethyltoluene

Phase change data

Data compiled by: Thermodynamics Research Center, NIST Boulder Laboratories, Chris Muzny director
Quantity | Value | Units | Method | Reference | Comment |
---|---|---|---|---|---|
Tboil | 494.1 | K | N/A | Anonymous, 1962 | Uncertainty assigned by TRC = 0.4 K |

Van Den Dool and Kratz RI, non-polar column, temperature ramp

Column type | Active phase | I | Reference | Comment |
---|---|---|---|---|
Capillary | OV-1 | 1238.3 | Gautzsch and Zinn, 1996 | 8. K/min; Tstart: 35. C; Tend: 300. C |

References

Anonymous, 1962
Anonymous, R.,
, Am. Pet. Inst. Res. Proj. 58A, Annu. Rep., 1962. [all data]
Gautzsch and Zinn, 1996
Gautzsch, R.; Zinn, P.,
Use of incremental models to estimate the retention indexes of aromatic compounds,
Chromatographia, 1996, 43, 3/4, 163-176, https://doi.org/10.1007/BF02292946
. [all data]