H2C=C radical anion
- Formula: C2H2-
- Molecular weight: 26.0378
- CAS Registry Number: 66295-36-1

Reaction thermochemistry data

Data compiled by: John E. Bartmess
Individual Reactions
(C2H2- • 4294967295) +
= C2H2-
By formula: (C2H2- • 4294967295C2H) + C2H = C2H2-
Quantity | Value | Units | Method | Reference | Comment |
---|---|---|---|---|---|
ΔrH° | 328. ± 15. | kJ/mol | N/A | Ervin, Gronert, et al., 1990 | gas phase; Vinylidene neutral: ΔHf<=99±2 kcal, Kiefer, Sidhu, et al., 1989 |
ΔrH° | 187. ± 14. | kJ/mol | Ther | Guo and Grabowski, 1990 | gas phase; Between PhF, Me3P |

Ion clustering data

Data compiled by: John E. Bartmess
Clustering reactions
(C2H2- • 4294967295) +
= C2H2-
By formula: (C2H2- • 4294967295C2H) + C2H = C2H2-
Quantity | Value | Units | Method | Reference | Comment |
---|---|---|---|---|---|
ΔrH° | 328. ± 15. | kJ/mol | N/A | Ervin, Gronert, et al., 1990 | gas phase; Vinylidene neutral: ΔHf<=99±2 kcal, Kiefer, Sidhu, et al., 1989 |
ΔrH° | 187. ± 14. | kJ/mol | Ther | Guo and Grabowski, 1990 | gas phase; Between PhF, Me3P |

References

Ervin, Gronert, et al., 1990
Ervin, K.M.; Gronert, S.; Barlow, S.E.; Gilles, M.K.; Harrison, A.G.; Bierbaum, V.M.; DePuy, C.H.; Lin, W.C.,
Bonds Strengths of Ethylene and Acetylene,
J. Am. Chem. Soc., 1990, 112, 15, 5750, https://doi.org/10.1021/ja00171a013
. [all data]
Kiefer, Sidhu, et al., 1989
Kiefer, J.H.; Sidhu, S.S.; Kumaran, S.S.; Irdan, E.A.,
RRKM Model of C2H4 Dissociation: Heat of Formation of Vinylidene,
Chem. Phys. Lett., 1989, 159, 1, 32, https://doi.org/10.1016/S0009-2614(89)87448-2
. [all data]
Guo and Grabowski, 1990
Guo, Y.; Grabowski, J.J.,
Gas Phase Ion Chemistry of the Vinylidene Radical Anion and the Acidity of the Vinyl Radical,
Int. J. Mass Spectrom. Ion Proc., 1990, 97, 3, 253, https://doi.org/10.1016/0168-1176(90)85003-K
. [all data]