1-ethylanthracene

Phase change data

Data compiled by: Thermodynamics Research Center, NIST Boulder Laboratories, Chris Muzny director

Quantity Value Units Method Reference Comment
Tfus372.KN/ABendas and Djerassi, 1956Uncertainty assigned by TRC = 3. K

In addition to the Thermodynamics Research Center (TRC) data available from this site, much more physical and chemical property data is available from the following TRC products:

References

Bendas and Djerassi, 1956
Bendas, H.; Djerassi, C., J. Am. Chem. Soc., 1956, 78, 2474. [all data]