Cyclohexanol, 2-chloro-, trans-
- Formula: C6H11ClO
- Molecular weight: 134.604
- IUPAC Standard InChIKey: NYEWDMNOXFGGDX-PHDIDXHHSA-N
- CAS Registry Number: 6628-80-4
- Chemical structure:
View 3d structure (requires JavaScript / HTML 5) - Stereoisomers:
- Other names: trans-2-Chlorocyclohexanol; 2-Chlorocyclohexanol, (E)-

Phase change data

Data compiled by: Thermodynamics Research Center, NIST Boulder Laboratories, Chris Muzny director
Quantity | Value | Units | Method | Reference | Comment |
---|---|---|---|---|---|
Tfus | 300.9 | K | N/A | Stevens and Grummitt, 1952 | Uncertainty assigned by TRC = 2. K |

Van Den Dool and Kratz RI, polar column, temperature ramp

Column type | Active phase | I | Reference | Comment |
---|---|---|---|---|
Capillary | DB-Wax | 1636. | Iwaoka, Hagi, et al., 1994 | He, 40. C @ 5. min, 2. K/min; Column length: 30. m; Column diameter: 0.25 mm; Tend: 200. C |

References

Stevens and Grummitt, 1952
Stevens, H.C.; Grummitt, O.,
The Stereochemitry of te Reactions of cis- and trans-2-Chlorocyclohexanol with Thionyl Chloride,
J. Am. Chem. Soc., 1952, 74, 4876-9. [all data]
Iwaoka, Hagi, et al., 1994
Iwaoka, W.; Hagi, Y.; Umano, K.; Shibamoto, T.,
Volatile chemicals identified in fresh and cooked breadfruit,
J. Agric. Food Chem., 1994, 42, 4, 975-976, https://doi.org/10.1021/jf00040a026
. [all data]