4-Aminoquinaldine
- Formula: C10H10N2
- Molecular weight: 158.1998
- IUPAC Standard InChIKey: COCFIBRMFPWUDW-UHFFFAOYSA-N
- CAS Registry Number: 6628-04-2
- Chemical structure:
View 3d structure (requires JavaScript / HTML 5) - Other names: 4-Amino-2-methylquinoline; 4-Quinolinamine, 2-methyl-

Phase change data

Data compiled as indicated in comments:
BS - Robert L. Brown and Stephen E. Stein
AC - William E. Acree, Jr., James S. Chickos
Quantity | Value | Units | Method | Reference | Comment |
---|---|---|---|---|---|
Tboil | 606.2 | K | N/A | Weast and Grasselli, 1989 | BS |
Tboil | 606. | K | N/A | Buckingham and Donaghy, 1982 | BS |
Quantity | Value | Units | Method | Reference | Comment |
Tfus | 442. to 443. | K | N/A | Buckingham and Donaghy, 1982 | BS |
Quantity | Value | Units | Method | Reference | Comment |
ΔsubH° | 115.3 ± 0.8 | kJ/mol | N/A | Ribeiro da Silva, Carvalho, et al., 1998 | AC |
Enthalpy of sublimation
ΔsubH (kJ/mol) | Temperature (K) | Method | Reference | Comment |
---|---|---|---|---|
112.1 ± 0.8 | 363. | ME | Ribeiro da Silva, Carvalho, et al., 1998 | Based on data from 352. to 373. K.; AC |

References

Weast and Grasselli, 1989
CRC Handbook of Data on Organic Compounds, 2nd Editon, Weast,R.C and Grasselli, J.G., ed(s)., CRC Press, Inc., Boca Raton, FL, 1989, 1. [all data]
Buckingham and Donaghy, 1982
Buckingham, J.; Donaghy, S.M.,
Dictionary of Organic Compounds: Fifth Edition, Chapman and Hall, New York, 1982, 1. [all data]
Ribeiro da Silva, Carvalho, et al., 1998
Ribeiro da Silva, Manuel A.V.; Carvalho, Ana Paula S.M.C.; Monte, Manuel J.S.; Giera, Edward,
Enthalpies of combustion, vapour pressures, and enthalpies of sublimation of 5-amino-6-nitroquinoline and 4-aminoquinaldine,
The Journal of Chemical Thermodynamics, 1998, 30, 7, 815-823, https://doi.org/10.1006/jcht.1998.0348
. [all data]