Borneol
- Formula: C10H18O
- Molecular weight: 154.2493
- IUPAC Standard InChIKey: DTGKSKDOIYIVQL-UHFFFAOYSA-N
- CAS Registry Number: 6627-72-1
- Chemical structure:
View 3d structure (requires JavaScript / HTML 5) - Species with the same structure:
- Stereoisomers:
- Other names: Bicyclo[2.2.1]heptan-2-ol, 1,7,7-trimethyl-; endo-Borneol; endo-2-Hydroxy-1,7,7-trimethylnorbornane; Camphol; Bicyclo[2.2.1]heptan-2-ol, 1,7,7-trimethyl-, endo-; 2-Bornanol, endo-; Baros camphor; Bhimsaim camphor; Borneo camphor; trans-Borneol; Bornyl alcohol; Camphane, 2-hydroxy-; 2-Camphanol; Dryobalanops camphor; 2-Hydroxycamphane; Malayan camphor; Sumatra camphor; 1,7,7-Trimethyl-bicyclo(2.2.1)heptan-2-ol, endo-; UN 1312; Bhimsiam camphor; dl-Borneol; Endo-1,7,7-trimethylbicyclo[2.2.1]heptan-2-ol; Endo-2-bornanol; Endo-2-camphanol; Endo-2-hydroxycamphane; Malay camphor; 1,7,7-Trimethylbicyclo[2.2.1]heptan-2-ol; 2-endo-Bornyl alcohol; Camphor

Phase change data

Data compiled by: William E. Acree, Jr., James S. Chickos
Enthalpy of vaporization
ΔvapH (kJ/mol) | Temperature (K) | Method | Reference | Comment |
---|---|---|---|---|
50.9 | 482. | A | Stephenson and Malanowski, 1987 | Based on data from 477. to 487. K. |
Enthalpy of sublimation
ΔsubH (kJ/mol) | Temperature (K) | Method | Reference | Comment |
---|---|---|---|---|
69.3 | 365. | A | Stephenson and Malanowski, 1987 | Based on data from 350. to 475. K. |

References

Stephenson and Malanowski, 1987
Stephenson, Richard M.; Malanowski, Stanislaw,
Handbook of the Thermodynamics of Organic Compounds, 1987, https://doi.org/10.1007/978-94-009-3173-2
. [all data]