Phenol, 2-bromo-4-methyl-
- Formula: C7H7BrO
- Molecular weight: 187.034
- IUPAC Standard InChIKey: MTIDYGLTAOZOGU-UHFFFAOYSA-N
- CAS Registry Number: 6627-55-0
- Chemical structure:

Phase change data

Data compiled as indicated in comments:
BS - Robert L. Brown and Stephen E. Stein
TRC - Thermodynamics Research Center, NIST Boulder Laboratories, Chris Muzny director
Quantity | Value | Units | Method | Reference | Comment |
---|---|---|---|---|---|
Tboil | 486.7 | K | N/A | Weast and Grasselli, 1989 | BS |
Quantity | Value | Units | Method | Reference | Comment |
Tfus | 328. | K | N/A | Lucas and Scudder, 1928 | Uncertainty assigned by TRC = 0.5 K; TRC |

Van Den Dool and Kratz RI, non-polar column, temperature ramp

Column type | Active phase | I | Reference | Comment |
---|---|---|---|---|
Capillary | OV-1 | 1153.5 | Gautzsch and Zinn, 1996 | 8. K/min; Tstart: 35. C; Tend: 300. C |

References

Weast and Grasselli, 1989
CRC Handbook of Data on Organic Compounds, 2nd Editon, Weast,R.C and Grasselli, J.G., ed(s)., CRC Press, Inc., Boca Raton, FL, 1989, 1. [all data]
Lucas and Scudder, 1928
Lucas, H.J.; Scudder, N.F.,
The Preparation of 2-Bromo-p-cresol from p-Nitrotoluene,
J. Am. Chem. Soc., 1928, 50, 244. [all data]
Gautzsch and Zinn, 1996
Gautzsch, R.; Zinn, P.,
Use of incremental models to estimate the retention indexes of aromatic compounds,
Chromatographia, 1996, 43, 3/4, 163-176, https://doi.org/10.1007/BF02292946
. [all data]