2,5,6-trimethyl-2-heptanol
- Formula: C10H22O
- Molecular weight: 158.2811
- CAS Registry Number: 66256-48-2

Phase change data

Data compiled by: Thermodynamics Research Center, NIST Boulder Laboratories, Chris Muzny director
Quantity | Value | Units | Method | Reference | Comment |
---|---|---|---|---|---|
Tboil | 466.15 | K | N/A | Wallach, 1911 | Uncertainty assigned by TRC = 4. K |

References

Wallach, 1911
Wallach, O.,
Justus Liebigs Ann. Chem., 1911, 381, 51. [all data]