3-ethyl-2,2,4-trimethyl-3-pentanol
- Formula: C10H22O
- Molecular weight: 158.2811
- CAS Registry Number: 66256-41-5

Phase change data

Data compiled by: Thermodynamics Research Center, NIST Boulder Laboratories, Chris Muzny director
Quantity | Value | Units | Method | Reference | Comment |
---|---|---|---|---|---|
Tboil | 462.65 | K | N/A | Nazarov, 1936 | Uncertainty assigned by TRC = 4. K |

References

Nazarov, 1936
Nazarov, I.N.,
Chem. Ber., 1936, 69, 21. [all data]