1,1,1-Trimethoxy-2-methylpropane
- Formula: C7H16O3
- Molecular weight: 148.2001
- IUPAC Standard InChIKey: BGLARIMANCDMQX-UHFFFAOYSA-N
- CAS Registry Number: 66226-66-2
- Chemical structure:
View 3d structure (requires JavaScript / HTML 5) - Species with the same structure:

Reaction thermochemistry data

Data compiled by: Hussein Y. Afeefy, Joel F. Liebman, and Stephen E. Stein
Individual Reactions
By formula: C7H16O3 + H2O = C5H10O2 + 2CH4O
Quantity | Value | Units | Method | Reference | Comment |
---|---|---|---|---|---|
ΔrH° | -32.79 ± 0.059 | kJ/mol | Cm | Wiberg, 1980 | liquid phase; solvent: Water; Hydrolysis |

References

Wiberg, 1980
Wiberg, K.B.,
Energies of organic compounds,
Rept. DOE-E(11-1)4060 Prepared for US Dept. of Energy by Yale Univ., New Haven, CT. Avail. NTIS, 1980, 1-24. [all data]