1,1,1,3,3,3-Hexafluoro-2-methoxy-2-propanol
- Formula: C4H4F6O2
- Molecular weight: 198.0638
- IUPAC Standard InChIKey: FEKJGFZZVNCSRO-UHFFFAOYSA-N
- CAS Registry Number: 662-16-8
- Chemical structure:

Gas phase thermochemistry data

Data compiled by: Hussein Y. Afeefy, Joel F. Liebman, and Stephen E. Stein
Quantity | Value | Units | Method | Reference | Comment |
---|---|---|---|---|---|
ΔfH°gas | -1506. | kJ/mol | Cm | Rogers and Rapiejko, 1971 | Hydration |

Phase change data

Data compiled by: Hussein Y. Afeefy, Joel F. Liebman, and Stephen E. Stein
Quantity | Value | Units | Method | Reference | Comment |
---|---|---|---|---|---|
ΔvapH° | 72.8 ± 0.8 | kJ/mol | C | Rogers and Rapiejko, 1971 | Hydration |

Reaction thermochemistry data

Data compiled by: Hussein Y. Afeefy, Joel F. Liebman, and Stephen E. Stein
Individual Reactions
By formula: C4H4F6O2 = CH4O + C3F6O
Quantity | Value | Units | Method | Reference | Comment |
---|---|---|---|---|---|
ΔrH° | 89. ± 1. | kJ/mol | Cm | Rogers and Rapiejko, 1971 | liquid phase; Hydration |

Condensed phase thermochemistry data

Data compiled by: Hussein Y. Afeefy, Joel F. Liebman, and Stephen E. Stein

Quantity Value Units Method Reference Comment
Δfliquid-1579.kJ/molCmRogers and Rapiejko, 1971Hydration

References

Rogers and Rapiejko, 1971
Rogers, F.E.; Rapiejko, R.J.,
Thermochemistry of carbonyl addition reactions. I. Addition of water and methanol to hexafluoroacetone,
J. Am. Chem. Soc., 1971, 93, 4596-1597. [all data]