1-Butene, 1-chloro-3-methyl-, (Z)-
- Formula: C5H9Cl
- Molecular weight: 104.578
- IUPAC Standard InChIKey: MXVSJNLRVLKAOG-ARJAWSKDSA-N
- CAS Registry Number: 66213-67-0
- Chemical structure:
View 3d structure (requires JavaScript / HTML 5) - Stereoisomers:

Reaction thermochemistry data

Data compiled by: Hussein Y. Afeefy, Joel F. Liebman, and Stephen E. Stein
Individual Reactions
By formula: C5H10Cl2 = C5H9Cl + HCl
Quantity | Value | Units | Method | Reference | Comment |
---|---|---|---|---|---|
ΔrH° | 63.32 ± 0.42 | kJ/mol | Eqk | Meged, Levanova, et al., 1978 | gas phase; Gas phase |
By formula: C5H9Cl = C5H9Cl
Quantity | Value | Units | Method | Reference | Comment |
---|---|---|---|---|---|
ΔrH° | 2.78 ± 0.063 | kJ/mol | Ciso | Meged, Levanova, et al., 1978 | gas phase; Gas phase |

References

Meged, Levanova, et al., 1978
Meged, V.M.; Levanova, S.V.; Shevtsova, L.A.; Rozhnev, A.M.,
Dehydrochlorination of 1,1-dichloro-3-methylbutane and geometric isomerization of chloromethylbutenes,
Russ. J. Phys. Chem. (Engl. Transl.), 1978, 52, 285. [all data]