1,2-Dichlorohexafluoropropane
- Formula: C3Cl2F6
- Molecular weight: 220.929
- IUPAC Standard InChIKey: JSEUKVSKOHVLOV-UHFFFAOYSA-N
- CAS Registry Number: 661-97-2
- Chemical structure:
View 3d structure (requires JavaScript / HTML 5) - Other names: 1,2-Dichloro-1,1,2,3,3,3-hexafluoropropane; Propane, 1,2-dichloro-1,1,2,3,3,3-hexafluoro-; Freon 216; Propane, 1,2-dichlorohexafluoro-; Ucon 216; 1,1,1,2,3,3-Hexafluoro-2,3-dichloropropane; 1,2-Dichloroperfluoropropane

Gas phase thermochemistry data

Data compiled by: Hussein Y. Afeefy, Joel F. Liebman, and Stephen E. Stein
Quantity | Value | Units | Method | Reference | Comment |
---|---|---|---|---|---|
ΔfH°gas | -1349.0 ± 4.4 | kJ/mol | Ccr | Papina, Kolesov, et al., 1987 |

Condensed phase thermochemistry data

Data compiled by: Hussein Y. Afeefy, Joel F. Liebman, and Stephen E. Stein
Quantity | Value | Units | Method | Reference | Comment |
---|---|---|---|---|---|
ΔfH°liquid | -1376.0 ± 4.4 | kJ/mol | Ccr | Papina, Kolesov, et al., 1987 | |
Quantity | Value | Units | Method | Reference | Comment |
ΔcH°liquid | -925.6 ± 2.0 | kJ/mol | Ccr | Papina, Kolesov, et al., 1987 |

Phase change data

Data compiled as indicated in comments:
BS - Robert L. Brown and Stephen E. Stein
TRC - Thermodynamics Research Center, NIST Boulder Laboratories, Chris Muzny director
AC - William E. Acree, Jr., James S. Chickos
Quantity | Value | Units | Method | Reference | Comment |
---|---|---|---|---|---|
Tboil | 308. | K | N/A | PCR Inc., 1990 | BS |
Tboil | 307.3 | K | N/A | Majer and Svoboda, 1985 | |
Quantity | Value | Units | Method | Reference | Comment |
Ttriple | 145.5 | K | N/A | Gorchakovskii, Zadov, et al., 1990 | Uncertainty assigned by TRC = 0.6 K; TRC |
Quantity | Value | Units | Method | Reference | Comment |
Tc | 446. | K | N/A | Majer and Svoboda, 1985 | |
Quantity | Value | Units | Method | Reference | Comment |
ΔvapH° | 27.3 | kJ/mol | N/A | Majer and Svoboda, 1985 | |
ΔvapH° | 26.9 ± 0.1 | kJ/mol | C | Majer, Svoboda, et al., 1980 | AC |
Enthalpy of vaporization
ΔvapH (kJ/mol) | Temperature (K) | Method | Reference | Comment |
---|---|---|---|---|
26.28 | 307.3 | N/A | Majer and Svoboda, 1985 | |
28.1 | 301. | N/A | Majer, Svoboda, et al., 1980 | Based on data from 296. to 307. K.; AC |
25.9 ± 0.1 | 313. | C | Majer, Svoboda, et al., 1980 | AC |
Enthalpy of vaporization
ΔvapH =
A exp(-βTr) (1 − Tr)β
ΔvapH =
Enthalpy of vaporization (at saturation pressure)
(kJ/mol)
Tr = reduced temperature (T / Tc)
View plot Requires a JavaScript / HTML 5 canvas capable browser.
Temperature (K) | A (kJ/mol) | β | Tc (K) | Reference | Comment |
---|---|---|---|---|---|
298. to 313. | 45.12 | 0.2911 | 446. | Majer and Svoboda, 1985 |

Reaction thermochemistry data

Data compiled by: Hussein Y. Afeefy, Joel F. Liebman, and Stephen E. Stein
Individual Reactions
By formula: C3F6 + Cl2 = C3Cl2F6
Quantity | Value | Units | Method | Reference | Comment |
---|---|---|---|---|---|
ΔrH° | -197.27 ± 0.48 | kJ/mol | Cm | Lacher, McKinley, et al., 1949 | gas phase; Heat of chlorination at 363 °K |

References

Papina, Kolesov, et al., 1987
Papina, T.S.; Kolesov, V.P.; Golovanova, Yu.G.,
Standard enthalpies of formation of 1,2-Dichlorohexafluoropropane and hexafluoropropane,
Russ. J. Phys. Chem. (Engl. Transl.), 1987, 61, 1168-1170. [all data]
PCR Inc., 1990
PCR Inc.,
Research Chemicals Catalog 1990-1991, PCR Inc., Gainesville, FL, 1990, 1. [all data]
Majer and Svoboda, 1985
Majer, V.; Svoboda, V.,
Enthalpies of Vaporization of Organic Compounds: A Critical Review and Data Compilation, Blackwell Scientific Publications, Oxford, 1985, 300. [all data]
Gorchakovskii, Zadov, et al., 1990
Gorchakovskii, V.K.; Zadov, V.E.; Podvezennyi, V.N.,
Physical properties of freon 216,
Inzh.-Fiz. Zh., 1990, 59, 122-6. [all data]
Majer, Svoboda, et al., 1980
Majer, Vladimír; Svoboda, Václav; Posta, Antonín; Pick, Jirí,
Determination of heats of vaporization and some other thermodynamic quantities for several fluorinated halogen derivatives of ethane and propane,
Collect. Czech. Chem. Commun., 1980, 45, 11, 3063-3068, https://doi.org/10.1135/cccc19803063
. [all data]
Lacher, McKinley, et al., 1949
Lacher, J.R.; McKinley, J.J.; Walden, C.; Lea, K.; Park, J.D.,
Reaction heats of organic fluorine compounds. II. The vapor phase heats of chlorination of some simple fluoroolefins,
J. Am. Chem. Soc., 1949, 71, 1334-1337. [all data]