Propane, 1,1,1,2,2,3-hexachloro-3,3-difluoro-
- Formula: C3Cl6F2
- Molecular weight: 286.747
- IUPAC Standard InChIKey: NKPXIDLSGFFJOI-UHFFFAOYSA-N
- CAS Registry Number: 661-96-1
- Chemical structure:
View 3d structure (requires JavaScript / HTML 5) - Other names: 1,1-Difluoro-1,2,2,3,3,3-hexachloro propane

Phase change data

Data compiled by: Thermodynamics Research Center, NIST Boulder Laboratories, Chris Muzny director
Quantity | Value | Units | Method | Reference | Comment |
---|---|---|---|---|---|
Tfus | 324.0 | K | N/A | Henne, Renoll, et al., 1939 | Uncertainty assigned by TRC = 1. K |

References

Henne, Renoll, et al., 1939
Henne, A.L.; Renoll, M.W.; Leicester, H.M.,
J. Am. Chem. Soc., 1939, 61, 938. [all data]