(E,Z) Di-1-propenyl methyl orthoacetate
- Formula: C9H16O3
- Molecular weight: 172.2215
- IUPAC Standard InChIKey: OKCRPXLGUMMWRB-CGXWXWIYSA-N
- CAS Registry Number: 66178-24-3
- Chemical structure:
View 3d structure (requires JavaScript / HTML 5) - Stereoisomers:

Reaction thermochemistry data

Data compiled by: Hussein Y. Afeefy, Joel F. Liebman, and Stephen E. Stein
Individual Reactions
By formula: C9H16O3 = C9H16O3
Quantity | Value | Units | Method | Reference | Comment |
---|---|---|---|---|---|
ΔrH° | -0.57 ± 0.05 | kcal/mol | Eqk | Taskinen and Lahteenmaki, 1978 | liquid phase; solvent: Neat |

References

Taskinen and Lahteenmaki, 1978
Taskinen, E.; Lahteenmaki, H.,
Thermodynamics of vinyl ethers. Part XX. α,β-Unsaturated orthoesters,
Finn. Chem. Lett., 1978, 47-50. [all data]