Dimethyl(E)-1-propenyl orthoacetate
- Formula: C7H14O3
- Molecular weight: 146.1843
- IUPAC Standard InChIKey: XJZFAGYWNJDGRK-AATRIKPKSA-N
- CAS Registry Number: 66178-21-0
- Chemical structure:
View 3d structure (requires JavaScript / HTML 5) - Stereoisomers:

Reaction thermochemistry data

Data compiled by: Hussein Y. Afeefy, Joel F. Liebman, and Stephen E. Stein
Individual Reactions
By formula: C7H14O3 = C7H14O3
Quantity | Value | Units | Method | Reference | Comment |
---|---|---|---|---|---|
ΔrH° | -0.7 ± 0.1 | kcal/mol | Eqk | Taskinen and Lahteenmaki, 1978 | liquid phase; solvent: Neat |

References

Taskinen and Lahteenmaki, 1978
Taskinen, E.; Lahteenmaki, H.,
Thermodynamics of vinyl ethers. Part XX. α,β-Unsaturated orthoesters,
Finn. Chem. Lett., 1978, 47-50. [all data]