2-methyl-3-propylphenol
- Formula: C10H14O
- Molecular weight: 150.2176
- IUPAC Standard InChIKey: XNCTZUPZTWUFNW-UHFFFAOYSA-N
- CAS Registry Number: 66142-78-7
- Chemical structure:
View 3d structure (requires JavaScript / HTML 5) - Permanent link for this species. Use this link for bookmarking this species for future reference.

Phase change data

Data compiled by: Thermodynamics Research Center, NIST Boulder Laboratories, Chris Muzny director
Quantity | Value | Units | Method | Reference | Comment |
---|---|---|---|---|---|
Tboil | 510.85 | K | N/A | Perkin, 1896 | Uncertainty assigned by TRC = 1. K |

References

Perkin, 1896
Perkin, W.H.,
LXIX. On Magnetic Rotatory Power, especially of Aromatic Compounds,
J. Chem. Soc., 1896, 69, 1025-1257. [all data]