Behenic alcohol
- Formula: C22H46O
- Molecular weight: 326.6000
- IUPAC Standard InChIKey: NOPFSRXAKWQILS-UHFFFAOYSA-N
- CAS Registry Number: 661-19-8
- Chemical structure:
View 3d structure (requires JavaScript / HTML 5) - Other names: 1-Docosanol; Docosyl alcohol; Docosanol-(1); Cachalot BE-22; Loxiol VPG 1451; Docosan-1-ol; Behenyl alcohol; n-Docosanol; Abreva; Docosanol; IK 2; Lanette 22; NAA 422; Nacol 22-97; NSC 8407; Stenol 1822; Stenol 1822A; Tadenan; Dehydag wax 22 (lanette); Emery 3304; N-Eicosanol

Phase change data

Data compiled as indicated in comments:
BS - Robert L. Brown and Stephen E. Stein
TRC - Thermodynamics Research Center, NIST Boulder Laboratories, Chris Muzny director
AC - William E. Acree, Jr., James S. Chickos
ALS - Hussein Y. Afeefy, Joel F. Liebman, and Stephen E. Stein
CAL - James S. Chickos, William E. Acree, Jr., Joel F. Liebman, Students of Chem 202 (Introduction to the Literature of Chemistry), University of Missouri -- St. Louis
Quantity | Value | Units | Method | Reference | Comment |
---|---|---|---|---|---|
Tfus | 343. | K | N/A | Kuchhal, Shukla, et al., 1979 | Crystal phase 1 phase; Uncertainty assigned by TRC = 0.25 K; TRC |
Tfus | 342.4 | K | N/A | Davies and Kybett, 1965 | Uncertainty assigned by TRC = 0.6 K; TRC |
Tfus | 343.2 | K | N/A | Shulman, Formo, et al., 1961 | Uncertainty assigned by TRC = 3. K; TRC |
Quantity | Value | Units | Method | Reference | Comment |
ΔvapH° | 135.9 ± 0.8 | kJ/mol | CGC | Nichols, Kweskin, et al., 2006 | AC |
Quantity | Value | Units | Method | Reference | Comment |
ΔsubH° | 207. ± 10. | kJ/mol | V | Davies and Kybett, 1965 | ALS |
ΔsubH° | 239. ± 10. | kJ/mol | N/A | Davies and Kybett, 1965 | AC |
Reduced pressure boiling point
Tboil (K) | Pressure (bar) | Reference | Comment |
---|---|---|---|
453.2 | 0.0003 | Weast and Grasselli, 1989 | BS |
Enthalpy of vaporization
ΔvapH (kJ/mol) | Temperature (K) | Method | Reference | Comment |
---|---|---|---|---|
115.3 | 351. | A,ME | Stephenson and Malanowski, 1987 | Based on data from 344. to 459. K. See also Davies and Kybett, 1965.; AC |
Enthalpy of sublimation
ΔsubH (kJ/mol) | Temperature (K) | Method | Reference | Comment |
---|---|---|---|---|
207. ± 10. | 330. | ME | Davies and Kybett, 1965 | Based on data from 335. to 341. K. See also Stephenson and Malanowski, 1987.; AC |
Enthalpy of fusion
ΔfusH (kJ/mol) | Temperature (K) | Method | Reference | Comment |
---|---|---|---|---|
85.07 | 340.8 | AC | Tong, Tan, et al., 2008 | Based on data from 80. to 400. K.; AC |
86.06 | 343.9 | N/A | van Miltenburg, Oonk, et al., 2001 | AC |
46.57 | 345.2 | N/A | Kuchhal, Shukla, et al., 1979 | AC |
Entropy of fusion
ΔfusS (J/mol*K) | Temperature (K) | Reference | Comment |
---|---|---|---|
50.72 | 333.9 | Kuchhal, Shukla, et al., 1979, 2 | CAL |
134.9 | 345.2 |

Normal alkane RI, non-polar column, temperature ramp

Data compiled by: NIST Mass Spectrometry Data Center, William E. Wallace, director

Column type CapillaryCapillaryCapillaryCapillaryCapillary
Active phase HP-5 MSSPB-1HP-5 MSHP-5 MSElite-5MS
Column length (m) 30.30.30.30.30.
Carrier gas  HeliumHeliumHeliumHe
Substrate
Column diameter (mm) 0.250.250.250.250.32
Phase thickness (μm) 0.250.250.250.250.5
Tstart (C) 60.50.150.60.40.
Tend (C) 300.250.280.300.280.
Heat rate (K/min) 15.5.5.15.4.
Initial hold (min) 2.3. 2.5.
Final hold (min) 10.15.10.10.10.
I 2470.2468.2493.2470.2494.
ReferenceXu, Han, et al., 2012Lazarevic, Palic, et al., 2010Vedernikov and Roschin, 2010Xu, Han, et al., 2009Tava, Pecetti, et al., 2007
Comment MSDC-RI MSDC-RI MSDC-RI MSDC-RI MSDC-RI
Column type CapillaryCapillary
Active phase Ultra-1SE-54
Column length (m) 25.25.
Carrier gas HeN2
Substrate
Column diameter (mm) 0.320.25
Phase thickness (μm) 0.25
Tstart (C) 80.60.
Tend (C) 260.260.
Heat rate (K/min) 3.6.
Initial hold (min)  2.
Final hold (min)
I 2443.2497.
ReferenceOkumura, 1991Bestmann, Classen, et al., 1988
Comment MSDC-RI MSDC-RI

Lee's RI, non-polar column, temperature ramp

Data compiled by: NIST Mass Spectrometry Data Center, William E. Wallace, director

Column type CapillaryCapillaryCapillary
Active phase DB-5MSDB-5MSDB-5
Column length (m) 30.30.30.
Carrier gas   He
Substrate
Column diameter (mm) 0.250.250.26
Phase thickness (μm) 0.50.50.25
Tstart (C) 40.40.50.
Tend (C) 310.310.300.
Heat rate (K/min) 10.4.6.
Initial hold (min) 1.1.4.
Final hold (min)   20.
I 397.16401.29400.57
ReferenceChen, Keeran, et al., 2002Chen, Keeran, et al., 2002Rostad and Pereira, 1986
Comment MSDC-RI MSDC-RI MSDC-RI

Kovats' RI, non-polar column, isothermal

Data compiled by: NIST Mass Spectrometry Data Center, William E. Wallace, director

Column type CapillaryCapillaryCapillary
Active phase OV-101CP Sil 5 CBDB-1
Column length (m) 15.30.30.
Carrier gas N2
Substrate
Column diameter (mm) 0.250.250.25
Phase thickness (μm) 0.20.250.25
Temperature (C) 200.240.240.
I 2470.42475.2476.
ReferenceKittiratanapiboon, Jeyashoke, et al., 1998Hanai and Hong, 1989Hanai and Hong, 1989
Comment MSDC-RI MSDC-RI MSDC-RI

Van Den Dool and Kratz RI, polar column, temperature ramp

Data compiled by: NIST Mass Spectrometry Data Center, William E. Wallace, director

Column type Capillary
Active phase DB-Wax
Column length (m) 60.
Carrier gas
Substrate
Column diameter (mm) 0.25
Phase thickness (μm) 0.25
Tstart (C) 50.
Tend (C) 230.
Heat rate (K/min) 2.
Initial hold (min)
Final hold (min) 60.
I 2979.
ReferenceShiratsuchi, Shimoda, et al., 1994
Comment MSDC-RI

Van Den Dool and Kratz RI, non-polar column, temperature ramp

Data compiled by: NIST Mass Spectrometry Data Center, William E. Wallace, director

Column type CapillaryCapillary
Active phase HP-5DB-5
Column length (m) 30.30.
Carrier gas HeHe
Substrate
Column diameter (mm) 0.250.26
Phase thickness (μm) 0.250.25
Tstart (C) 50.50.
Tend (C) 280.300.
Heat rate (K/min) 4.6.
Initial hold (min) 5.4.
Final hold (min)  20.
I 2456.2501.
ReferenceLazari, Skaltsa, et al., 2000Rostad and Pereira, 1986
Comment MSDC-RI MSDC-RI

References

Kuchhal, Shukla, et al., 1979
Kuchhal, Y.K.; Shukla, R.N.; Biswas, A.B.,
Differential thermal analysis of n-long chain alcohols and corresponding alkoxy ethanols,
Thermochimica Acta, 1979, 31, 1, 61-70, https://doi.org/10.1016/0040-6031(79)80008-8
. [all data]
Davies and Kybett, 1965
Davies, M.; Kybett, B.,
Sublimation and vaporization heats of long-chain alcohols,
Trans. Faraday Soc., 1965, 61, 1608. [all data]
Shulman, Formo, et al., 1961
Shulman, S.; Formo, M.W.; Rheineck, A.E.,
Aliphatic Urethanes. Effect of Chain Length on Some Physical Properties,
J. Am. Oil Chem. SOc., 1961, 38, 205-8. [all data]
Nichols, Kweskin, et al., 2006
Nichols, Gary; Kweskin, Sasha; Frericks, Margaret; Reiter, Sarah; Wang, Gin; Orf, Jennifer; Carvallo, Brett; Hillesheim, Dorothea; Chickos, James,
Evaluation of the Vaporization, Fusion, and Sublimation Enthalpies of the 1-Alkanols: The Vaporization Enthalpy of 1-, 6-, 7-, and 9-Heptadecanol, 1-Octadecanol, 1-Eicosanol, 1-Docosanol, 1-Hexacosanol, and Cholesterol at T = 298.15 K by Correlation Gas Chromatography,
J. Chem. Eng. Data, 2006, 51, 2, 475-482, https://doi.org/10.1021/je0503857
. [all data]
Weast and Grasselli, 1989
CRC Handbook of Data on Organic Compounds, 2nd Editon, Weast,R.C and Grasselli, J.G., ed(s)., CRC Press, Inc., Boca Raton, FL, 1989, 1. [all data]
Stephenson and Malanowski, 1987
Stephenson, Richard M.; Malanowski, Stanislaw,
Handbook of the Thermodynamics of Organic Compounds, 1987, https://doi.org/10.1007/978-94-009-3173-2
. [all data]
Tong, Tan, et al., 2008
Tong, Bo; Tan, Zhi-Cheng; Wang, Shao-Xu,
Thermodynamic Properties of 1-Docosanol,
Acta Phys. Chim. Sin., 2008, 24, 9, 1699-1702, https://doi.org/10.3866/PKU.WHXB20080930
. [all data]
van Miltenburg, Oonk, et al., 2001
van Miltenburg, J. Cees; Oonk, Harry A.J.; Ventola, Lourdes,
Heat Capacities and Derived Thermodynamic Functions of 1-Octadecanol, 1-Nonadecanol, 1-Eicosanol, and 1-Docosanol between 10 K and 370 K,
J. Chem. Eng. Data, 2001, 46, 1, 90-97, https://doi.org/10.1021/je000048s
. [all data]
Kuchhal, Shukla, et al., 1979, 2
Kuchhal, Y.K.; Shukla, R.N.; Biswas, A.B.,
Differential thermal analysis of n-long chain alcohols and corresponding alkoxy ethanols,
Thermochim. Acta, 1979, 31, 1, 61, https://doi.org/10.1016/0040-6031(79)80008-8
. [all data]