4-Dichloromethyl-4-methyl-2,5-cyclohexadien-1-one
- Formula: C8H8Cl2O
- Molecular weight: 191.055
- IUPAC Standard InChIKey: MJRRCEHODULPAV-UHFFFAOYSA-N
- CAS Registry Number: 6611-78-5
- Chemical structure:
View 3d structure (requires JavaScript / HTML 5) - Other names: 4-Dichloromethyl-4-methyl-2,5-cyclohexadienone; 2,5-Cyclohexadien-1-one, 4-(dichloromethyl)-4-methyl-; 6-Dichloromethyl-6-methyl-1,4--cyclohexadien-3-one

Condensed phase thermochemistry data

Data compiled by: Hussein Y. Afeefy, Joel F. Liebman, and Stephen E. Stein
Quantity | Value | Units | Method | Reference | Comment |
---|---|---|---|---|---|
ΔcH°solid | -987.14 | kcal/mol | Ccb | Auwers, 1907 |

References

Auwers, 1907
Auwers, K.,
Mittheilungen aus dem chemischen Institut der Universitat Greifswald. I. Ueber Alkylidendihydrobenzolderivate,
Ann. Chem., 1907, 352, 219-272. [all data]