2-Pentene, 2-methoxy-4,4-dimethyl-, (Z)-
- Formula: C8H16O
- Molecular weight: 128.2120
- IUPAC Standard InChIKey: WQPGFODYOJCBPR-SREVYHEPSA-N
- CAS Registry Number: 66017-30-9
- Chemical structure:
View 3d structure (requires JavaScript / HTML 5) - Stereoisomers:

Reaction thermochemistry data

Data compiled by: Hussein Y. Afeefy, Joel F. Liebman, and Stephen E. Stein
Individual Reactions
By formula: C8H16O = C8H16O
Quantity | Value | Units | Method | Reference | Comment |
---|---|---|---|---|---|
ΔrH° | 16.4 ± 0.5 | kJ/mol | Eqk | Taskinen and Anttila, 1977 | gas phase |

References

Taskinen and Anttila, 1977
Taskinen, E.; Anttila, M.,
Thermodynamics of vinyl ethers. XXI. Evaluation of some cis interaction energies,
Tetrahedron, 1977, 33, 2423-2427. [all data]