1-Pentene, 2-methoxy-4,4-dimethyl-
- Formula: C8H16O
- Molecular weight: 128.2120
- IUPAC Standard InChIKey: LSHQWPNTYWCQMU-UHFFFAOYSA-N
- CAS Registry Number: 66017-25-2
- Chemical structure:

Reaction thermochemistry data

Data compiled by: Hussein Y. Afeefy, Joel F. Liebman, and Stephen E. Stein
Individual Reactions
By formula: C8H16O = C8H16O
Quantity | Value | Units | Method | Reference | Comment |
---|---|---|---|---|---|
ΔrH° | 3.44 ± 0.1 | kcal/mol | Eqk | Taskinen and Anttila, 1977 | gas phase |
By formula: C8H16O = C8H16O
Quantity | Value | Units | Method | Reference | Comment |
---|---|---|---|---|---|
ΔrH° | 3.9 ± 0.1 | kcal/mol | Eqk | Taskinen and Anttila, 1977 | gas phase |

References

Taskinen and Anttila, 1977
Taskinen, E.; Anttila, M.,
Thermodynamics of vinyl ethers. XXI. Evaluation of some cis interaction energies,
Tetrahedron, 1977, 33, 2423-2427. [all data]