3-Hexene, 3-methoxy-2,5-dimethyl-, (Z)-
- Formula: C9H18O
- Molecular weight: 142.2386
- IUPAC Standard InChIKey: PYPPCCYSBRCXAF-TWGQIWQCSA-N
- CAS Registry Number: 66017-24-1
- Chemical structure:

Reaction thermochemistry data

Data compiled by: Hussein Y. Afeefy, Joel F. Liebman, and Stephen E. Stein
Individual Reactions
By formula: C9H18O = C9H18O
Quantity | Value | Units | Method | Reference | Comment |
---|---|---|---|---|---|
ΔrH° | 1.4 ± 0.1 | kcal/mol | Eqk | Taskinen and Anttila, 1977 | gas phase |

References

Taskinen and Anttila, 1977
Taskinen, E.; Anttila, M.,
Thermodynamics of vinyl ethers. XXI. Evaluation of some cis interaction energies,
Tetrahedron, 1977, 33, 2423-2427. [all data]