2,5-Dimethyl-3-methoxy-hexene
- Formula: C9H18O
- Molecular weight: 142.2386
- IUPAC Standard InChIKey: RNXMYQBHWTXSGP-UHFFFAOYSA-N
- CAS Registry Number: 66017-22-9
- Chemical structure:
View 3d structure (requires JavaScript / HTML 5) - Permanent link for this species. Use this link for bookmarking this species for future reference.

Reaction thermochemistry data

Data compiled by: Hussein Y. Afeefy, Joel F. Liebman, and Stephen E. Stein
Individual Reactions
By formula: C9H18O = C9H18O
Quantity | Value | Units | Method | Reference | Comment |
---|---|---|---|---|---|
ΔrH° | -7.2 ± 0.4 | kJ/mol | Eqk | Taskinen and Anttila, 1977 | gas phase |
By formula: C9H18O = C9H18O
Quantity | Value | Units | Method | Reference | Comment |
---|---|---|---|---|---|
ΔrH° | 5.9 ± 0.4 | kJ/mol | Eqk | Taskinen and Anttila, 1977 | gas phase |

References

Taskinen and Anttila, 1977
Taskinen, E.; Anttila, M.,
Thermodynamics of vinyl ethers. XXI. Evaluation of some cis interaction energies,
Tetrahedron, 1977, 33, 2423-2427. [all data]