Dicamba methyl ester
- Formula: C8H8Cl2O3
- Molecular weight: 223.053
- IUPAC Standard InChIKey: AWSBKDYHGOOSML-UHFFFAOYSA-N
- CAS Registry Number: 6597-78-0
- Chemical structure:
View 3d structure (requires JavaScript / HTML 5) - Other names: Disugran; Benzoic acid, 3,6-dichloro-2-methoxy-, methyl ester; o-Anisic acid, 3,6-dichloro-, methyl ester; Banvel 60CS16; Methyl 2-methoxy-3,6-dichlorobenzoate; Methyl 3,6-dichloro-o-anisate; Methyl 3,6-dichloro-2-methoxybenzoate; Racusa; Racuza; 2-Methoxy-3,6-dichlorobenzoic acid methyl ester; 60CS16; Benzoic acid, 3,6-dichloro-2-methoxy-, methylated; Dicamba-methyl

Phase change data

Data compiled as indicated in comments:
TRC - Thermodynamics Research Center, NIST Boulder Laboratories, Chris Muzny director
AC - William E. Acree, Jr., James S. Chickos
Quantity | Value | Units | Method | Reference | Comment |
---|---|---|---|---|---|
Tfus | 305.14 | K | N/A | Donnelly, Drewes, et al., 1990 | Uncertainty assigned by TRC = 0.2 K; TRC |
Enthalpy of fusion
ΔfusH (kcal/mol) | Temperature (K) | Method | Reference | Comment |
---|---|---|---|---|
4.419 | 304.6 | N/A | Acree, 1991 | AC |
4.419 | 304.6 | DSC | Donnelly, Drewes, et al., 1990, 2 | AC |

References

Donnelly, Drewes, et al., 1990
Donnelly, J.R.; Drewes, L.A.; Johnson, R.L.; Munslow, W.D.; Knapp, K.K.; Sovocool, G.W.,
Purity and heat of fusion data for environmental standards as determined by differential scanning calorimetry,
Thermochim. Acta, 1990, 167, 2, 155, https://doi.org/10.1016/0040-6031(90)80476-F
. [all data]
Acree, 1991
Acree, William E.,
Thermodynamic properties of organic compounds: enthalpy of fusion and melting point temperature compilation,
Thermochimica Acta, 1991, 189, 1, 37-56, https://doi.org/10.1016/0040-6031(91)87098-H
. [all data]
Donnelly, Drewes, et al., 1990, 2
Donnelly, J.R.; Drewes, L.A.; Johnson, R.L.; Munslow, W.D.; Knapp, K.K.; Sovocool, G.W.,
Purity and heat of fusion data for environmental standards as determined by differential scanning calorimetry,
Thermochimica Acta, 1990, 167, 2, 155-187, https://doi.org/10.1016/0040-6031(90)80476-F
. [all data]