CAS Reg. No. 65887-19-6
- CAS Registry Number: 65887-19-6

Reaction thermochemistry data

Data compiled by: John E. Bartmess
Individual Reactions
(CAS Reg. No. 65887-19-6 • 4294967295) + = CAS Reg. No. 65887-19-6
By formula: (CAS Reg. No. 65887-19-6 • 4294967295C3H4) + C3H4 = CAS Reg. No. 65887-19-6
Quantity | Value | Units | Method | Reference | Comment |
---|---|---|---|---|---|
ΔrH° | 33.8 ± 2.1 | kcal/mol | N/A | DePuy, Gronert, et al., 1989 | gas phase |

References

DePuy, Gronert, et al., 1989
DePuy, C.H.; Gronert, S.; Barlow, S.E.; Bierbaum, V.M.; Damrauer, R.,
The Gas Phase Acidities of the Alkanes,
J. Am. Chem. Soc., 1989, 111, 6, 1968, https://doi.org/10.1021/ja00188a003
. [all data]