Glycyl-L-tyrosine
- Formula: C11H14N2O4
- Molecular weight: 238.2399
- IUPAC Standard InChIKey: XBGGUPMXALFZOT-SECBINFHSA-N
- CAS Registry Number: 658-79-7
- Chemical structure:
View 3d structure (requires JavaScript / HTML 5) - Other names: L-Tyrosine, N-glycyl-; N-glycyl-L-tyrosine

Reaction thermochemistry data

Data compiled by: Robert C. Dunbar
Individual Reactions
By formula: Na+ + C11H14N2O4 = (Na+ • C11H14N2O4)
Free energy of reaction
ΔrG° (kJ/mol) | T (K) | Method | Reference |
---|---|---|---|
159. | 0. | CIDC | Feng, Gronert, et al., 1999 |

Ion clustering data

Data compiled by: Robert C. Dunbar
Clustering reactions
By formula: Na+ + C11H14N2O4 = (Na+ • C11H14N2O4)
Free energy of reaction
ΔrG° (kJ/mol) | T (K) | Method | Reference |
---|---|---|---|
159. | 0. | CIDC | Feng, Gronert, et al., 1999 |

References

Feng, Gronert, et al., 1999
Feng, W.Y.; Gronert, S.; Lebrilla, C.B.,
Lithium and sodium ion binding energies of N-acetyl and N-glycyl amino acids,
J. Am. Chem. Soc., 1999, 121, 6, 1365, https://doi.org/10.1021/ja983116s
. [all data]