Acetic acid, trifluoro-, 4-nitrophenyl ester
- Formula: C8H4F3NO4
- Molecular weight: 235.1169
- IUPAC Standard InChIKey: JFOIBTLTZWOAIC-UHFFFAOYSA-N
- CAS Registry Number: 658-78-6
- Chemical structure:
View 3d structure (requires JavaScript / HTML 5) - Other names: p-Nitrophenyl trifluoroacetate; 4-Nitrophenyl trifluoroacetate; Acetic acid, trifluoro-, p-nitrophenyl ester; Trifluoroacetic acid p-nitrophenyl ester; Trifluoroacetic acid, 4-nitrophenyl ester

Phase change data

Data compiled by: Robert L. Brown and Stephen E. Stein
Reduced pressure boiling point
Tboil (K) | Pressure (bar) | Reference |
---|---|---|
393.2 | 0.016 | Weast and Grasselli, 1989 |

Van Den Dool and Kratz RI, non-polar column, temperature ramp

Column type | Active phase | I | Reference | Comment |
---|---|---|---|---|
Capillary | VF-5MS | 1240. | Todua, 2011 | 30. m/0.25 mm/0.25 μm, He; Tstart: 60. C; Tend: 270. C |

Van Den Dool and Kratz RI, non-polar column, custom temperature program

Column type | Active phase | I | Reference | Comment |
---|---|---|---|---|
Capillary | 5 % Phenyl methyl siloxane | 1188. | Zaikin, 2003 | Column length: 30. m; Column diameter: 0.19 mm; Program: 50 C to 120 C at 5 C/min; 120 C to 290 C at 12 C/min |

References

Weast and Grasselli, 1989
CRC Handbook of Data on Organic Compounds, 2nd Editon, Weast,R.C and Grasselli, J.G., ed(s)., CRC Press, Inc., Boca Raton, FL, 1989, 1. [all data]
Todua, 2011
Todua, N.G.,
Retention Data. NIST Mass Spectrometry Data Center., NIST Mass Spectrometry Data Center, 2011. [all data]
Zaikin, 2003
Zaikin, V.G.,
Personal Communication: Retention indices measured during the period 2001 to 2003, 2003. [all data]