1,4-butanediol, 2,3-diphenyl-
- Formula: C16H18O2
- Molecular weight: 242.3129
- IUPAC Standard InChIKey: RODMSFOPKZGWIX-UHFFFAOYSA-N
- CAS Registry Number: 6583-62-6
- Chemical structure:
View 3d structure (requires JavaScript / HTML 5) - Permanent link for this species. Use this link for bookmarking this species for future reference.

Phase change data

Data compiled by: Thermodynamics Research Center, NIST Boulder Laboratories, Chris Muzny director
Quantity | Value | Units | Method | Reference | Comment |
---|---|---|---|---|---|
Tfus | 410.15 | K | N/A | Saegebarth, 1962 | Uncertainty assigned by TRC = 2. K |

References

Saegebarth, 1962
Saegebarth, K.A.,
, 1962. [all data]