L-Methionine, N-acetyl-
- Formula: C7H13NO3S
- Molecular weight: 191.248
- IUPAC Standard InChIKey: XUYPXLNMDZIRQH-LURJTMIESA-N
- CAS Registry Number: 65-82-7
- Chemical structure:

Reaction thermochemistry data

Data compiled by: Robert C. Dunbar
Individual Reactions
By formula: Na+ + C7H13NO3S = (Na+ • C7H13NO3S)
Free energy of reaction
ΔrG° (kcal/mol) | T (K) | Method | Reference |
---|---|---|---|
34.3 | 0. | CIDC | Feng, Gronert, et al., 1999 |

Ion clustering data

Data compiled by: Robert C. Dunbar
Clustering reactions
By formula: Na+ + C7H13NO3S = (Na+ • C7H13NO3S)
Free energy of reaction
ΔrG° (kcal/mol) | T (K) | Method | Reference |
---|---|---|---|
34.3 | 0. | CIDC | Feng, Gronert, et al., 1999 |

References

Feng, Gronert, et al., 1999
Feng, W.Y.; Gronert, S.; Lebrilla, C.B.,
Lithium and sodium ion binding energies of N-acetyl and N-glycyl amino acids,
J. Am. Chem. Soc., 1999, 121, 6, 1365, https://doi.org/10.1021/ja983116s
. [all data]