Tungsten, pentacarbonyl(pyridazine-N1)-, (OC-6-22)-
- Formula: C9H4N2O5W
- Molecular weight: 403.98
- IUPAC Standard InChIKey: KIFKRFWLPKCZGO-UHFFFAOYSA-N
- CAS Registry Number: 65761-20-8
- Chemical structure:

Phase change data

Data compiled by: José A. Martinho Simões
Quantity | Value | Units | Method | Reference | Comment |
---|---|---|---|---|---|
ΔsubH° | 106.4 ± 2.5 | kJ/mol | N/A | Boxhoorn, Ernsting, et al., 1980 |

References

Boxhoorn, Ernsting, et al., 1980
Boxhoorn, G.; Ernsting, J.M.; Stufkens, D.J.; Oskam, A.,
Thermochim. Acta, 1980, 42, 315. [all data]