2,6-Dimethylbenzonitrile
- Formula: C9H9N
- Molecular weight: 131.1745
- IUPAC Standard InChIKey: QSACPWSIIRFHHR-UHFFFAOYSA-N
- CAS Registry Number: 6575-13-9
- Chemical structure:
View 3d structure (requires JavaScript / HTML 5) - Other names: Benzonitrile, 2,6-dimethyl-

Condensed phase thermochemistry data

Data compiled by: Hussein Y. Afeefy, Joel F. Liebman, and Stephen E. Stein
Quantity | Value | Units | Method | Reference | Comment |
---|---|---|---|---|---|
ΔfH°solid | 62.3 ± 1.5 | kJ/mol | Ccb | Acree, Tucker, et al., 1991 | |
Quantity | Value | Units | Method | Reference | Comment |
ΔcH°solid | -4890.1 ± 1.0 | kJ/mol | Ccb | Acree, Tucker, et al., 1991 |

Phase change data

Data compiled as indicated in comments:
ALS - Hussein Y. Afeefy, Joel F. Liebman, and Stephen E. Stein
DRB - Donald R. Burgess, Jr.
Quantity | Value | Units | Method | Reference | Comment |
---|---|---|---|---|---|
ΔsubH° | 83.9 ± 2.8 | kJ/mol | V | Acree, Tucker, et al., 1991 | ALS |
ΔsubH° | 83.9 | kJ/mol | N/A | Acree, Tucker, et al., 1991 | DRB |

References

Acree, Tucker, et al., 1991
Acree, W.E., Jr.; Tucker, S.A.; Zvaigzne, A.I.; Meng-Yan, Y.; Pilcher, G.; Ribeiro Da Silva, M.D.M.,
Enthalpies of combustion of 2,4,6-trimethylbenzonitrile, 2,4,6-trimethylbenzonitrile N-oxide,, 2,6-dimethylbenzonitrile, 2,4,6-trimethoxybenzonitrile, and 2,4,6-trimethoxybenzonitrile N-oxide: the dissociation enthalpies of the (N-O) bonds,
J. Chem. Thermodyn., 1991, 23, 31-36. [all data]