Oxocane
- Formula: C7H14O
- Molecular weight: 114.1855
- IUPAC Standard InChIKey: HZIVRQOIUMAXID-UHFFFAOYSA-N
- CAS Registry Number: 6572-98-1
- Chemical structure:
View 3d structure (requires JavaScript / HTML 5) - Permanent link for this species. Use this link for bookmarking this species for future reference.

Gas phase thermochemistry data

Data compiled by: Glushko Thermocenter, Russian Academy of Sciences, Moscow
Constant pressure heat capacity of gas
Cp,gas (cal/mol*K) | Temperature (K) | Reference | Comment |
---|---|---|---|
10.31 | 50. | Dorofeeva O.V., 1992 | p=1 bar. |
14.71 | 100. | ||
19.12 | 150. | ||
23.963 | 200. | ||
32.287 | 273.15 | ||
35.4 ± 1.4 | 298.15 | ||
35.609 | 300. | ||
47.978 | 400. | ||
58.984 | 500. | ||
68.188 | 600. | ||
75.848 | 700. | ||
82.285 | 800. | ||
87.741 | 900. | ||
92.395 | 1000. | ||
96.372 | 1100. | ||
99.785 | 1200. | ||
102.72 | 1300. | ||
105.25 | 1400. | ||
107.45 | 1500. |

References

Dorofeeva O.V., 1992
Dorofeeva O.V.,
Ideal gas thermodynamic properties of oxygen heterocyclic compounds. Part 2. Six-membered, seven-membered and eight-membered rings,
Thermochim. Acta, 1992, 200, 121-150. [all data]