1,3-Dioxocane
- Formula: C6H12O2
- Molecular weight: 116.1583
- IUPAC Standard InChIKey: CJSITSBWCLTCAP-UHFFFAOYSA-N
- CAS Registry Number: 6572-90-3
- Chemical structure:
View 3d structure (requires JavaScript / HTML 5) - Permanent link for this species. Use this link for bookmarking this species for future reference.

Gas phase thermochemistry data

Data compiled by: Glushko Thermocenter, Russian Academy of Sciences, Moscow
Constant pressure heat capacity of gas
Cp,gas (cal/mol*K) | Temperature (K) | Reference | Comment |
---|---|---|---|
9.006 | 50. | Dorofeeva O.V., 1992 | p=1 bar. |
12.81 | 100. | ||
17.58 | 150. | ||
22.60 | 200. | ||
30.550 | 273.15 | ||
33.4 ± 1.2 | 298.15 | ||
33.590 | 300. | ||
44.685 | 400. | ||
54.489 | 500. | ||
62.713 | 600. | ||
69.572 | 700. | ||
75.339 | 800. | ||
80.225 | 900. | ||
84.383 | 1000. | ||
87.935 | 1100. | ||
90.978 | 1200. | ||
93.590 | 1300. | ||
95.844 | 1400. | ||
97.789 | 1500. |

Condensed phase thermochemistry data

Data compiled by: Hussein Y. Afeefy, Joel F. Liebman, and Stephen E. Stein
Quantity | Value | Units | Method | Reference | Comment |
---|---|---|---|---|---|
ΔcH°liquid | -883.70 ± 0.30 | kcal/mol | Ccb | Skuratov, Strepikheev, et al., 1957 | Reanalyzed by Cox and Pilcher, 1970, Original value = -884.0 kcal/mol; Combustion of liq at 293 K; Corresponding ΔfHºliquid = -90.50 kcal/mol (simple calculation by NIST; no Washburn corrections) |

Phase change data

Data compiled by: Hussein Y. Afeefy, Joel F. Liebman, and Stephen E. Stein
Enthalpy of vaporization
ΔvapH (kcal/mol) | Temperature (K) | Method | Reference | Comment |
---|---|---|---|---|
10.7 | 293. | V | Skuratov, Strepikheev, et al., 1957 | Combustion of liq at 293 K |

References

Dorofeeva O.V., 1992
Dorofeeva O.V.,
Ideal gas thermodynamic properties of oxygen heterocyclic compounds. Part 2. Six-membered, seven-membered and eight-membered rings,
Thermochim. Acta, 1992, 200, 121-150. [all data]
Skuratov, Strepikheev, et al., 1957
Skuratov, S.M.; Strepikheev, A.A.; Shtekhter, S.M.; Volokhina, A.V.,
About the enthalpies of polymerization of cyclic formales,
Dokl. Akad. Nauk SSSR, 1957, 117, 263-265. [all data]
Cox and Pilcher, 1970
Cox, J.D.; Pilcher, G.,
Thermochemistry of Organic and Organometallic Compounds, Academic Press, New York, 1970, 1-636. [all data]