1-Pentanol, 3,4-dimethyl-
- Formula: C7H16O
- Molecular weight: 116.2013
- IUPAC Standard InChIKey: SVJNECJVNWTYQG-UHFFFAOYSA-N
- CAS Registry Number: 6570-87-2
- Chemical structure:
View 3d structure (requires JavaScript / HTML 5) - Other names: 3,4-Dimethyl-1-pentanol; Pentanol, 3,4-dimethyl

Phase change data

Data compiled as indicated in comments:
TRC - Thermodynamics Research Center, NIST Boulder Laboratories, Chris Muzny director
AC - William E. Acree, Jr., James S. Chickos
Quantity | Value | Units | Method | Reference | Comment |
---|---|---|---|---|---|
Tboil | 438. ± 6. | K | AVG | N/A | Average of 6 values; Individual data points |
Enthalpy of vaporization
ΔvapH (kJ/mol) | Temperature (K) | Reference | Comment |
---|---|---|---|
50.3 | 388. | Wilhoit and Zwolinski, 1973 | Based on data from 393. to 438. K.; AC |

References

Wilhoit and Zwolinski, 1973
Wilhoit, R.C.; Zwolinski, B.J.,
Physical and thermodynamic properties of aliphatic alcohols,
J. Phys. Chem. Ref. Data Suppl., 1973, 1, 2, 1. [all data]