Benzene, 1,3,5-tris(1-methylpropyl)-
- Formula: C18H30
- Molecular weight: 246.4308
- IUPAC Standard InChIKey: LNCLJYZMKXSECB-UHFFFAOYSA-N
- CAS Registry Number: 6565-55-5
- Chemical structure:

Reaction thermochemistry data

Data compiled by: Hussein Y. Afeefy, Joel F. Liebman, and Stephen E. Stein
Individual Reactions
By formula: C18H30 = C18H30
Quantity | Value | Units | Method | Reference | Comment |
---|---|---|---|---|---|
ΔrH° | 93.3 ± 4.2 | kJ/mol | Eqk | Arnett, Sanda, et al., 1967 | liquid phase; solvent: CS2 |

References

Arnett, Sanda, et al., 1967
Arnett, E.M.; Sanda, J.C.; Bollinger, J.M.; Barber, M.,
Crowded benzenes. VI. The strain energy in o-di-t-butylbenzenes,
J. Am. Chem. Soc., 1967, 89, 5389-5400. [all data]